{"text_format":"1","workbook":"xlsx","n_sheets":3,"sheets":["Form","List","Data"],"not_rendered":{"charts":0,"images":8,"macros":1,"external_links":0,"defined_names":41,"comments":0,"pivot_tables":0},"unopened":[],"bounds":{"document_bytes":16777216,"sheet_cells":100000,"rows_first":2000,"rows_last":500,"rows_between":2000,"halvings":0,"cell_chars":16384,"cell_head_chars":4096},"cells_cut":0,"cells_raw":0,"read":"whole","date_system":"1900"}

{"sheet":"Form","index":0,"n_rows":101,"n_cols":24,"rows_kept":101,"cut":false,"hidden":false,"merged":[[36,2,36,22],[32,6,32,10],[39,8,40,8],[33,2,33,8],[100,1,100,7],[96,1,96,25],[99,9,99,15],[38,2,38,23],[37,2,37,23],[49,13,49,15],[48,13,48,17],[48,12,49,12],[39,15,40,15],[39,3,40,3],[48,2,49,11],[47,2,47,23],[49,16,49,17],[68,2,68,3],[73,2,73,9],[99,1,99,7],[39,2,40,2],[39,9,40,10],[39,12,40,12],[39,13,40,14],[96,27,96,34],[97,27,97,35],[93,6,93,10],[79,1,79,56],[57,2,62,23],[64,23,65,23],[64,20,64,22],[65,20,65,22],[81,1,81,24],[82,1,82,23],[84,1,84,23],[85,1,85,23],[88,1,88,7],[90,2,90,23],[93,1,93,5],[74,16,74,23],[73,10,73,15],[74,10,74,15],[74,7,74,9],[94,1,94,5],[68,21,68,22],[64,2,64,8],[56,2,56,6],[94,6,94,10],[88,9,88,12],[89,9,89,12],[89,1,89,7],[71,2,71,22],[65,12,65,16],[64,9,65,10],[74,2,74,3],[64,17,65,18],[64,12,64,16],[73,16,73,23],[65,2,65,8],[74,4,74,6],[68,7,68,9],[68,16,68,17],[68,11,68,12],[68,13,68,14],[92,2,92,24],[91,2,91,24],[0,0,0,23],[4,2,4,9],[11,11,11,13],[12,11,12,13],[7,2,7,5],[11,2,11,5],[12,2,12,5],[1,0,1,24],[2,0,2,24],[7,21,7,23],[9,21,9,23],[11,21,12,23],[3,18,3,20],[4,18,4,20],[7,18,7,20],[9,18,9,20],[11,18,11,20],[12,6,12,10],[11,14,11,17],[12,18,12,20],[11,6,11,10],[12,14,12,17],[9,2,9,5],[9,6,9,17],[18,2,18,4],[18,11,18,12],[18,13,18,19],[16,6,16,12],[22,2,31,4],[23,15,23,22],[33,9,33,22],[29,16,29,22],[27,17,27,22],[27,15,27,16],[24,15,24,22],[25,15,25,23],[26,15,26,22],[32,16,32,22],[31,16,31,22],[30,6,30,22],[20,2,20,8],[7,6,7,11],[3,22,4,22],[3,23,4,24],[3,21,4,21],[31,6,31,10],[7,16,7,17],[7,12,7,15],[39,22,39,23],[39,21,40,21],[39,16,40,20],[39,4,40,7],[39,11,40,11],[14,2,14,22],[16,2,16,5],[16,13,16,16],[28,6,28,10],[25,6,25,10],[26,6,26,10],[16,17,16,23],[20,9,20,23],[27,6,27,10],[28,16,28,22],[18,21,18,23],[18,5,18,10],[50,2,50,8],[50,9,50,11],[50,13,50,15],[50,16,50,17],[50,18,50,23],[48,18,49,23],[41,4,41,6],[41,9,41,10],[41,13,41,14],[41,16,41,17],[41,18,41,20]]}
[]
["Tree Risk Assessment Form 1 : Tree Group Inspection"]
["樹木風險評估表格1 : 樹群檢查表"]
[null,null,null,null,null,null,null,null,null,null,null,null,null,null,null,null,null,null,"Form 1 Ref. No.:"]
[null,null,"General Information  基本資料 ",null,null,null,null,null,null,null,null,null,null,null,null,null,null,null,"表格1編號:"]
[]
[]
[null,null,"Dept. / Agency 部門 / 機構:",null,null,null,null,null,null,null,null,null,"Inspection Officer 巡查人員:",null,null,null,null,null,"Post 職位:"]
[]
[null,null,"Project / Contract No.工程 /合約編號:",null,null,null,null,null,null,null,null,null,null,null,null,null,null,null,"File Ref. 檔案編號:"]
[]
[null,null,"Date of Inspection",null,null,null,null,null,null,null,null,"Last Inspection Date",null,null,null,null,null,null,"Inspection Frequency"]
[null,null,"巡查日期:",null,null,null,"(dd/mm/yyyy)",null,null,null,null,"上次巡查日期:",null,null,"(dd/mm/yyyy)",null,null,null,"巡查週期:"]
[]
[null,null,"Location Information  位置資料"]
[]
[null,null,"Masterzone Ref.主區編號:",null,null,null,123,null,null,null,null,null,null,"Subzone Ref. 副區編號: "]
[]
[null,null,"Location (English) :\n地點 (英文) : ",null,null,null,null,null,null,null,null,"Location (Chinese) :\n地點 (中文) : ",null,null,null,null,null,null,null,null,"District:\n地區:"]
[]
[null,null,"Tree Risk Management Zone 樹木風險管理地區類別:"]
[]
[null,null,"Location Types\n地點類別:\n(multiple selections allowed \n可選多於一項)"]
[null,null,null,null,null,null,"Roadside landscaped area 路旁綠化地區",null,null,null,null,null,null,null,null,"Government compound 政府建築物"]
[null,null,null,null,null,null,"Public park/recreation venue 公園/康樂場地",null,null,null,null,null,null,null,null,"Unleased/uallocated government land 未批租/未撥用的政府土地"]
[null,null,null,null,null,null,"Planter box 花盆",null,null,null,null,null,null,null,null,"Recreational site/facility inside country park 郊野公園內康樂用地或設施"]
[null,null,null,null,null,null,"Tree Pit/Tree Ring 樹穴/樹圈",null,null,null,null,null,null,null,null,"SIMAR slopes 系統性鑑辨維修責任的斜坡   "]
[null,null,null,null,null,null,"Housing estate 屋邨",null,null,null,null,null,null,null,null,"SIMAR slope ref:"]
[null,null,null,null,null,null,"Central divider 中央分隔帶"]
[null,null,null,null,null,null,"Others (please specify) 其他 (請說明): "]
[]
[]
[]
[null,null,"Nearby Utility Post No. 就近公用設施編號:"]
[]
[]
[null,null,"Tree Information  樹木基本資料"]
[null,null,"The size of a tree group should be defined by location types, such as public parks, SIMAR slopes, tree pits, etc. with due consideration given to the limitations of visual tree assessment. \nNo more than 50 trees shall be included in a Tree Group.\n在決定樹群的大小時，應參照地點類別，如公園、系統性鑑辨維修責任的斜坡、樹穴等，並需考慮目測法的局限，每個樹群不可多於50棵樹。 "]
[null,null,"(A) Triage Trees and Trees Require Remedial Actions or Form 2 Assessment  \n分流樹木及需要進行緩減措施 / 表格 2 評估的樹木"]
[null,null,"TMCP\nTree ID\n樹木\n編號","Dept.\nTree ID\n部門\n樹木\n編號","Tree Species\n樹種 ",null,null,null,"DBH\n(mm)\n胸徑\n(毫米)","Estimated\nTree\nHeight\n(m)\n大約樹高\n(米)",null,"Estimated\nCrown\nSpread\n(m)\n大約樹冠\n闊度\n(米)","Tree Status\n樹木類別","Overall\nTree\nConditions\n整體樹木\n狀況",null,"Triage Colour\n分流顏色","Remedial Action / Form 2 Assessment\n緩減措施 / 表格2評估   ",null,null,null,null,"Anticipated\nCompletion\nDate\n預計完成日期\n(dd/mm/yyyy) ","Reference Coordinates of Tree \n樹木參考座標"]
[null,null,null,null,null,null,null,null,null,null,null,null,null,null,null,null,null,null,null,null,null,null,"\nX","\nY"]
[]
[]
[]
[]
[]
[]
[null,null,"(B) Other Trees (Non-Triage Trees - trees do not need further actions)\n其他樹木（非分流樹木 - 無需進一步行動的樹木）"]
[null,null,"Tree Species\n樹種 ",null,null,null,null,null,null,null,null,null,"App. Quantity of Trees\n大約樹木            數量","Range of Tree Height\n樹高範圍 ",null,null,null,null,"Overall Tree Conditions\n整體樹木狀況"]
[null,null,null,null,null,null,null,null,null,null,null,null,null,"From (m)\n由（米）",null,null,"To (m)\n至（米）"]
[]
[]
[]
[]
[]
[]
[null,null,"Overall Remarks 整體評語"]
[]
[]
[]
{"$rows_left_out":42}
{"sheet":"List","index":1,"n_rows":864,"n_cols":29,"rows_kept":864,"cut":false,"hidden":false,"merged":[[0,27,0,28],[0,13,0,16],[0,17,0,18],[0,19,0,20],[0,21,0,22],[0,23,0,24],[0,25,0,26],[0,11,0,12],[0,0,0,1],[0,2,0,3],[0,4,0,6],[0,7,0,8],[0,9,0,10]]}
["YesNo",null,"Department",null,"Full Dept Name",null,null,"Dept Code",null,"Inspection Frequency",null,"Tree Risk Management Zone",null,"Tree Species",null,null,null,"Tree Status",null,"Overall Tree Conditions",null,"Triage Colour",null,"Remedial Actions/Form 2",null,"Attachment Type",null,"HK Districts"]
["Yes",1,"AFCD",1,"Agriculture, Fisheries and Conservation Department ","漁農自然護理署",1,"AFC",1,"Less than 少於 3 months 個月",1,"Category I 第一類",1,"Unidentified未能鑑別","Unidentified","未能鑑別",-2,"OVT 古樹名木",1,"Normal 正常",1,"Black 黑",3,"Crown cleaning 清理樹冠",1,"TREE 樹木",1,"Central and Western 中西區",1]
["No",0,"AMS",2,"Auxillary Medical Service","醫療輔助隊",2,"AMS",2,"3 months 個月",2,"Category II 第二類",2,"Others其他","Others","其他",-1,"Stonewall Tree 石牆樹",2,"Fair 一般",2,"Red 紅",2,"Crown thinning 樹冠疏理",2,"PHOTO 照片",2,"Eastern 東區",2]
[null,null,"ArchSD",3,"Architectural Services Department","建築署",3,"ASD",3,"6 months 個月",3,"Category III 第三類",3,"Acacia auriculiformis耳果相思(耳葉相思)","Acacia auriculiformis","耳果相思(耳葉相思)",1,"Large Tree 大樹",7,"Poor 差",3,"Orange 橙",4,"Crown reduction 縮減樹冠",3,"MAP 地圖",3,"Southern 南區",11]
[null,null,"BD",4,"Building Department","屋宇署",4,"DLD",4,"12 months 個月",4,null,null,"Acacia confusa台灣相思","Acacia confusa","台灣相思",2,"Other Trees 其他樹木",5,"Very Poor 十分差",4,"Yellow 黃",1,"Crown raising 樹冠提升",4,"OTHER 其他",4,"Wan Chai 灣仔區",15]
[null,null,"C&SD ",5,"Census and Statistics Department","政府統計處",5,"CNS",5,"24 months 個月",5,null,null,"Acacia dealbata銀荊","Acacia dealbata","銀荊",3,null,null,"Dead Tree 死樹",5,"No 無",0,"Structural Pruning 結構修剪 ",5,null,null,"Kowloon City 九龍城區",4]
[null,null,"CAD",6,"Civil Aviation Department","民航處",6,"CAD",6,"36 months 個月",6,null,null,"Acacia holosericea絹毛相思","Acacia holosericea","絹毛相思",4,null,null,null,null,null,null,"Cabling, bracing or propping 纜索拉纜或支柱",6,null,null,"Kwai Tsing 葵青區",5]
[null,null,"CAS",7,"Civil Aid Service","民眾安全服務隊",7,"CAS",7,"48 months 個月",7,null,null,"Acacia mangium大葉相思(馬占相思)","Acacia mangium","大葉相思(馬占相思)",5,null,null,null,null,null,null,"Pest/ disease control 病蟲害控制",7,null,null,"Sham Shui Po 深水埗區",10]
[null,null,"CEDD",8,"Civil Engineering and Development Department","土木工程拓展署",8,"CED",8,"60 months 個月",8,null,null,"Acer buergerianum三角槭","Acer buergerianum","三角槭",6,null,null,null,null,null,null,"Removal 移除",8,null,null,"Wong Tai Sin 黃大仙區",16]
[null,null,"CPU",9,"Central Policy Unit","中央政策組",9,"CPU",9,"Over 超過 60 months 個月",9,null,null,"Acer palmatum雞爪槭","Acer palmatum","雞爪槭",7,null,null,null,null,null,null,"Form 2 Assessment 表格2評估",9,null,null,"Yau Tsim Mong 油尖旺區",17]
[null,null,"CSD",10,"Hong Kong Correctional Services","香港懲教署",10,"CSD",10,"Ad hoc",10,null,null,"Acer tutcheri嶺南槭","Acer tutcheri","嶺南槭",8,null,null,null,null,null,null,"Others 其他:",-1,null,null,"Islands 離島區",3]
[null,null,"CSO",11,"Chief Secretary for Administration's Office","政務司司長辦公室",11,"CSO",11,null,null,null,null,"Acmena acuminatissima肖蒲桃","Acmena acuminatissima","肖蒲桃",9,null,null,null,null,null,null,null,null,null,null,"Kwun Tong 觀塘區",6]
[null,null,"CUSTOMS",12,"Customs and Excise Department","香港海關",12,"CUS",12,null,null,null,null,"Acmena 'Doubloon'紅車(千頭肖蒲桃)","Acmena 'Doubloon'","紅車(千頭肖蒲桃)",10,null,null,null,null,null,null,null,null,null,null,"North 北區",7]
[null,null,"DEVB",13,"Development Bureau","發展局(文物)",13,"DEV",13,null,null,null,null,"Acronychia pedunculata山油柑(降真香)","Acronychia pedunculata","山油柑(降真香)",11,null,null,null,null,null,null,null,null,null,null,"Sai Kung 西貢區",8]
[null,null,"DH",14,"Department of Health","衛生署",14,"DOH",14,null,null,null,null,"Adenanthera microsperma海紅豆","Adenanthera microsperma","海紅豆",12,null,null,null,null,null,null,null,null,null,null,"Sha Tin 沙田區",9]
[null,null,"DoJ",15,"Department of Justice","律政司",15,"DOJ",15,null,null,null,null,"Adinandra millettii黃瑞木","Adinandra millettii","黃瑞木",13,null,null,null,null,null,null,null,null,null,null,"Tai Po 大埔區",12]
[null,null,"DSD",16,"Drainage Services Department","渠務署",16,"DSD",16,null,null,null,null,"Aegle marmelos木橘(肖木蘋果)","Aegle marmelos","木橘(肖木蘋果)",14,null,null,null,null,null,null,null,null,null,null,"Tsuen Wan 荃灣區",13]
[null,null,"EDB",17,"Education Bureau","教育局",17,"EDB",17,null,null,null,null,"Agathis dammara貝殼杉","Agathis dammara","貝殼杉",15,null,null,null,null,null,null,null,null,null,null,"Tuen Mun 屯門區",14]
[null,null,"EMSD",18,"Electrical and Mechanical Services Department","機電工程署",18,"EMS",18,null,null,null,null,"Aglaia odorata米仔蘭","Aglaia odorata","米仔蘭",16,null,null,null,null,null,null,null,null,null,null,"Yuen Long 元朗區",18]
[null,null,"EPD",19,"Environmental Protection Department","環境保護署",19,"EPD",19,null,null,null,null,"Ailanthus fordii福氏臭椿(常綠臭椿)","Ailanthus fordii","福氏臭椿(常綠臭椿)",17]
[null,null,"FEHD",20,"Food and Environmental Hygiene Department","食物環境衞生署",20,"FEH",20,null,null,null,null,"Alangium chinense八角楓","Alangium chinense","八角楓",18]
[null,null,"FSD",21,"Fire Services Department","消防處",21,"FSD",21,null,null,null,null,"Albizia chinensis楹樹","Albizia chinensis","楹樹",19]
[null,null,"GFS",22,"Government Flying Service","政府飛行服務隊",22,"GFS",22,null,null,null,null,"Albizia julibrissin合歡","Albizia julibrissin","合歡",20]
[null,null,"GL",23,"Government Laboratory","政府化驗所",23,"GOL",23,null,null,null,null,"Albizia lebbeck大葉合歡","Albizia lebbeck","大葉合歡",21]
[null,null,"GLD",24,"Government Logistics Department","政府物流服務署",24,"GLD",24,null,null,null,null,"Albizia lucidior光葉合歡","Albizia lucidior","光葉合歡",22]
[null,null,"GPA",25,"Government Property Agency","政府產業署",25,"GPA",25,null,null,null,null,"Albizia procera黃豆樹","Albizia procera","黃豆樹",23]
[null,null,"HYA",26,"Home and Youth Affairs Bureau","民政及青年事務局",26,"HYA",26,null,null,null,null,"Samanea saman (syn. Albizia saman)雨樹","Samanea saman (syn. Albizia saman)","雨樹",24]
[null,null,"HAD",27,"Home Affairs Department","民政事務總署",27,"HAD",27,null,null,null,null,"Aleurites moluccana石栗","Aleurites moluccana","石栗",25]
[null,null,"HD",28,"Housing Department","房屋署",28,"HSD",28,null,null,null,null,"Alnus japonica赤楊","Alnus japonica","赤楊",26]
[null,null,"HKO",29,"Hong Kong Observatory","香港天文台",29,"HKO",29,null,null,null,null,"Alsophila spinulosa刺桫欏","Alsophila spinulosa","刺桫欏",27]
[null,null,"HKPF",30,"Hong Kong Police Force","香港警務處",30,"HKP",30,null,null,null,null,"Alstonia scholaris糖膠樹(黑板樹)","Alstonia scholaris","糖膠樹(黑板樹)",28]
[null,null,"HKPO",31,"Hong Kong Post","香港郵政",31,"POS",31,null,null,null,null,"Altingia chinensis蕈樹(阿丁楓、山荔枝)","Altingia chinensis","蕈樹(阿丁楓、山荔枝)",29]
[null,null,"HyD",32,"Highways Department","路政署",32,"HYD",32,null,null,null,null,"Amentotaxus argotaenia穗花杉","Amentotaxus argotaenia","穗花杉",30]
[null,null,"ICAC",33,"Independent Commission Against Corruption","香港廉政公署",33,"ICA",33,null,null,null,null,"Annona glabra圓滑番荔枝 ","Annona glabra","圓滑番荔枝 ",31]
[null,null,"JUDICIARY",34,"Judiciary","香港司法機構",34,"JUD",34,null,null,null,null,"Annona squamosa番荔枝","Annona squamosa","番荔枝",32]
[null,null,"LandsD",35,"Lands Department","地政總署",35,"LAN",35,null,null,null,null,"Antidesma bunius五月茶(五味子)","Antidesma bunius","五月茶(五味子)",33]
[null,null,"LCSD",36,"Leisure and Cultural Services Department","康樂及文化事務署",36,"LCS",36,null,null,null,null,"Antidesma fordii黃毛五月茶","Antidesma fordii","黃毛五月茶",34]
[null,null,"MarDep",37,"Hong Kong Marine Department","香港海事處",37,"MAD",37,null,null,null,null,"Antidesma ghaesembilla方葉五月茶","Antidesma ghaesembilla","方葉五月茶",35]
[null,null,"RTHK",38,"Radio Television Hong Kong","香港電台",38,"RTH",38,null,null,null,null,"Antidesma japonicum日本五月茶","Antidesma japonicum","日本五月茶",36]
[null,null,"SB",39,"Security Bureau","保安局",39,"SEB",39,null,null,null,null,"Aphananthe cuspidata (syn. Gironniera nitida)滇糙葉樹(坡命工)","Aphananthe cuspidata (syn. Gironniera nitida)","滇糙葉樹(坡命工)",37]
[null,null,"SWD",40,"Social Welfare Department","社會福利署",40,"SWD",40,null,null,null,null,"Aporusa dioica銀柴(大沙葉)","Aporusa dioica","銀柴(大沙葉)",38]
[null,null,"TD",41,"Transport Department","運輸署",41,"TRD",41,null,null,null,null,"Aquilaria sinensis土沉香(牙香樹)","Aquilaria sinensis","土沉香(牙香樹)",39]
[null,null,"Treasury",42,"The Treasury","庫務署",42,"TRE",42,null,null,null,null,"Aralia finlaysoniana虎刺楤木","Aralia finlaysoniana","虎刺楤木",40]
[null,null,"WSD",43,"Water Supplies Department","水務署",43,"WSD",43,null,null,null,null,"Araucaria bidwillii大葉南洋杉","Araucaria bidwillii","大葉南洋杉",41]
[null,null,"HA",44,"Hospital Authority","醫院管理局",44,"HAU",44,null,null,null,null,"Araucaria cunninghamii南洋杉(花旗杉)","Araucaria cunninghamii","南洋杉(花旗杉)",42]
[null,null,"AA",45,"Airport Authority","機場管理局",45,"AAU",45,null,null,null,null,"Araucaria heterophylla異葉南洋杉","Araucaria heterophylla","異葉南洋杉",43]
[null,null,"The LINK",46,"The LINK","領展",46,"LIN",46,null,null,null,null,"Archidendron clypearia猴耳環","Archidendron clypearia","猴耳環",44]
[null,null,"MTRC",47,"Mass Transport Railway Corporation","港鐵公司",47,"MTR",47,null,null,null,null,"Archidendron lucidum亮葉猴耳環","Archidendron lucidum","亮葉猴耳環",45]
[null,null,"PriO",48,"Private Owner","私人業權",48,"PRO",48,null,null,null,null,"Archontophoenix alexandrae假檳榔","Archontophoenix alexandrae","假檳榔",46]
[null,null,null,null,null,null,null,null,null,null,null,null,null,"Areca catechu檳榔","Areca catechu","檳榔",47]
[null,null,null,null,null,null,null,null,null,null,null,null,null,"Arenga pinnata砂糖椰子(桄榔)","Arenga pinnata","砂糖椰子(桄榔)",48]
[null,null,null,null,null,null,null,null,null,null,null,null,null,"Artocarpus communis (syn. Artocarpus altilis) 麵包樹","Artocarpus communis (syn. Artocarpus altilis) ","麵包樹",49]
[null,null,null,null,null,null,null,null,null,null,null,null,null,"Artocarpus hypargyreus白桂木","Artocarpus hypargyreus","白桂木",50]
[null,null,null,null,null,null,null,null,null,null,null,null,null,"Artocarpus heterophyllus (syn. Artocarpus macrocarpon)菠蘿蜜","Artocarpus heterophyllus (syn. Artocarpus macrocarpon)","菠蘿蜜",51]
[null,null,null,null,null,null,null,null,null,null,null,null,null,"Artocarpus nitidus subsp. lingnanensis桂木(紅桂木)","Artocarpus nitidus subsp. lingnanensis","桂木(紅桂木)",52]
[null,null,null,null,null,null,null,null,null,null,null,null,null,"Astrocaryum jauari-","Astrocaryum jauari","-",53]
[null,null,null,null,null,null,null,null,null,null,null,null,null,"Averrhoa carambola楊桃","Averrhoa carambola","楊桃",54]
[null,null,null,null,null,null,null,null,null,null,null,null,null,"Bauhinia x blakeana洋紫荊","Bauhinia x blakeana","洋紫荊",55]
[null,null,null,null,null,null,null,null,null,null,null,null,null,"Bauhinia purpurea紅花羊蹄甲","Bauhinia purpurea","紅花羊蹄甲",56]
[null,null,null,null,null,null,null,null,null,null,null,null,null,"Bauhinia tomentosa黃花羊蹄甲","Bauhinia tomentosa","黃花羊蹄甲",57]
{"$rows_left_out":805}
{"sheet":"Data","index":2,"n_rows":65,"n_cols":6,"rows_kept":65,"cut":false,"hidden":true,"merged":[]}
["Field Name","Field Value","Table","Table Field","Type","Remark"]
["Form1RefNo",{"$f":"IF(ISBLANK(F1RefNo_1), \"\", CONCATENATE(F1RefNo_1, \"-\", F1RefNo_2, \"-\", F1RefNo_3))","v":""}]
["Department",{"$f":"IF(ISBLANK(Dept), \"\", Dept)","v":""}]
["InspOfficer",{"$f":"IF(ISBLANK(InspOfficer), \"\", InspOfficer)","v":""}]
["InspOfficerPost",{"$f":"IF(ISBLANK(Post), \"\", Post)","v":""}]
["ContractNo",{"$f":"IF(ISBLANK(ContractNo), \"\", ContractNo)","v":""}]
["FileRef",{"$f":"IF(ISBLANK(FileRef), \"\", FileRef)","v":""}]
["InspDate",{"$f":"IF(ISBLANK(InspDate), \"\", InspDate)","v":""}]
["LastInspDate",{"$f":"IF(ISBLANK(LastInspDate), \"\", LastInspDate)","v":""}]
["InspFreq",{"$f":"INDEX(List!K2:K11, MATCH(InspFreq,List!J2:J11,0))","v":{"$error":"#N/A"}},null,null,null,{"$f":"IF(ISBLANK(InspFreq), \"\", InspFreq)","v":""}]
["MZone",{"$f":"IF(ISBLANK(MZone), \"\", MZone)","v":"1900-05-02"}]
["Szone",{"$f":"IF(ISBLANK(SZone), \"\", SZone)","v":""}]
["LocEng",{"$f":"IF(ISBLANK(LocEng), \"\", LocEng)","v":""}]
["LocChi",{"$f":"IF(ISBLANK(LocChi), \"\", LocChi)","v":""}]
["District",{"$f":"INDEX(List!AC2:AC19, MATCH(District,List!AB2:AB19,0))","v":{"$error":"#N/A"}},null,null,null,{"$f":"IF(ISBLANK(District), \"\", District)","v":""}]
["Category",{"$f":"INDEX(List!M2:M4, MATCH(Catagory,List!L2:L4,0))","v":{"$error":"#N/A"}},null,null,null,{"$f":"IF(ISBLANK(Catagory), \"\", Catagory)","v":""}]
["locRoadside",false]
["locPublic",false]
["locPlanter",false]
["locTreePit",false]
["locEstate",false]
["locDivider",false]
["locOthers",false]
["locGov",false]
["locUnleased",false]
["locCountoryPark",false]
["locSimar",false]
["locSimarRef",{"$f":"IF(ISBLANK(locSimarRef), \"\", locSimarRef)","v":""}]
["locOthersDesc",{"$f":"IF(ISBLANK(locOthersDesc), \"\", locOthersDesc)","v":""}]
["lampNum",{"$f":"IF(ISBLANK(lampNum), \"\", lampNum)","v":""}]
["TreeIDList",{"$f":"getBreakDownValue4Table(\"TableTree\", 1, \"1^4\")","v":""}]
["TreeSpeciesList",{"$f":"getBreakDownValue4Table2(\"TableTree\", 1, \"1^5\", List!N2:N284, List!Q2:Q284)","v":""},null,null,null,{"$f":"getBreakDownValue4Table(\"TableTree\", 1, \"1^5\")","v":""}]
["TreeSpeciesOthersList",{"$f":"getBreakDownValue4Table(\"TableTree\", 1, \"1^8\")","v":""}]
["TreeDBHList",{"$f":"getBreakDownValue4Table(\"TableTree\", 1, \"1^9\")","v":""}]
["TreeHeightList",{"$f":"getBreakDownValue4Table(\"TableTree\", 1, \"1^10\")","v":""}]
["CrownSpreadList",{"$f":"getBreakDownValue4Table(\"TableTree\", 1, \"1^12\")","v":""}]
["TreeStatusList",{"$f":"getBreakDownValue4Table2(\"TableTree\", 1, \"1^13\", List!R2:R5, List!S2:S5)","v":""},null,null,null,{"$f":"getBreakDownValue4Table(\"TableTree\", 1, \"1^13\")","v":""}]
["TreeConditionsList",{"$f":"getBreakDownValue4Table2(\"TableTree\", 1, \"1^14\", List!T2:T10, List!U2:U10)","v":""},null,null,null,{"$f":"getBreakDownValue4Table(\"TableTree\", 1, \"1^14\")","v":""}]
["TriageColourList",{"$f":"getBreakDownValue4Table2(\"TableTree\", 1, \"1^16\", List!V2:V7, List!W2:W7)","v":""},null,null,null,{"$f":"getBreakDownValue4Table(\"TableTree\", 1, \"1^16\")","v":""}]
["RemedialActionList",{"$f":"getBreakDownValue4Table2(\"TableTree\", 1, \"1^17\", List!X2:X11, List!Y2:Y11)","v":""},null,null,null,{"$f":"getBreakDownValue4Table(\"TableTree\", 1, \"1^17\")","v":""}]
["RemedialActionOtherList",{"$f":"getBreakDownValue4Table(\"TableTree\", 1, \"1^19\")","v":""}]
["CompletionDateList",{"$f":"getBreakDownValue4Table(\"TableTree\", 1, \"1^22\")","v":""}]
["XcoorList",{"$f":"getBreakDownValue4Table(\"TableTree\", 1, \"1^23\")","v":""}]
["YcoorList",{"$f":"getBreakDownValue4Table(\"TableTree\", 1, \"1^24\")","v":""}]
["OtherTreesSpeciesList",{"$f":"getBreakDownValue4Table2(\"TableOtherTrees\", 1, \"1^3\", List!N2:N284, List!Q2:Q284)","v":""},null,null,null,{"$f":"getBreakDownValue4Table(\"TableOtherTrees\", 1, \"1^3\")","v":""}]
["OtherTreesSpeciesOthersList",{"$f":"getBreakDownValue4Table(\"TableOtherTrees\", 1, \"1^10\")","v":""}]
["OtherTreesQtyList",{"$f":"getBreakDownValue4Table(\"TableOtherTrees\", 1, \"1^13\")","v":""}]
["OtherTreesHeightFromList",{"$f":"getBreakDownValue4Table(\"TableOtherTrees\", 1, \"1^14\")","v":""}]
["OtherTreesHeightToList",{"$f":"getBreakDownValue4Table(\"TableOtherTrees\", 1, \"1^17\")","v":""}]
["OtherTreesConditionsList",{"$f":"getBreakDownValue4Table2(\"TableOtherTrees\", 1, \"1^19\", List!T2:T10, List!U2:U10)","v":""},null,null,null,{"$f":"getBreakDownValue4Table(\"TableOtherTrees\", 1, \"1^18\")","v":""}]
["OverallRemarks",{"$f":"IF(ISBLANK(OverallRemarks), \"\", OverallRemarks)","v":""}]
["TotalA",{"$f":"IF(ISBLANK(TotalA), \"\", TotalA)","v":0}]
["TotalB",{"$f":"IF(ISBLANK(TotalB), \"\", TotalB)","v":0}]
["TotalAB",{"$f":"IF(ISBLANK(TotalAB), \"\", TotalAB)","v":0}]
["SumBlack",{"$f":"IF(ISBLANK(SumBlack), \"\", SumBlack)","v":0}]
["SumRed",{"$f":"IF(ISBLANK(SumRed), \"\", SumRed)","v":0}]
["SumOrange",{"$f":"IF(ISBLANK(SumOrange), \"\", SumOrange)","v":0}]
["SumYellow",{"$f":"IF(ISBLANK(SumYellow), \"\", SumYellow)","v":0}]
["SumNone",{"$f":"IF(ISBLANK(SumNone), \"\", SumNone)","v":0},null,null,null,{"$f":"getBreakDownValue4Table(\"TableAttachment\", 1, \"1^3\")","v":""}]
["AttachTypeList",{"$f":"getBreakDownValue4Table2(\"TableAttachment\", 1, \"1^3\", List!Z2:Z10, List!AA2:AA10)","v":""}]
{"$rows_left_out":5}